유니티 commandinvokationfailure failed to build apk. CommandInvokationFailure: Failed to align APK package.

유니티 commandinvokationfailure failed to build apk Rating: 6,1/10 640 reviews

UnityでAndroidビルドができなかったときの対処方法

유니티 commandinvokationfailure failed to build apk

And since 2014, I have been living in Indonesia. I also tried replace the tools folder like in the link you mentioned. I am using simple password as stated above, also were working fine with Unity version 5. And I thought it could sign but apparently it couldn't. Accept the Licence Agreement,make an account and download the release. The Gradle workaround doesn't work for me due to errors with my Firebase installation.


Next

I can't get unity to build/ run my game. : Unity3D

유니티 commandinvokationfailure failed to build apk

Is that the same platforms the error might be referring too? So I think I'll manage on my own here. To proceed, either fix the issues identified by lint, or modify your build script as follows: … android { lintOption. Could it have anything to do with just selecting arm vs x86 and arm together? I got this error when I forgot to select a keystore. Videos are usually a part of a series. I quess I just have to wait for new versions and hope it will work later.

Next

[빌드오류]Error building Player: CommandInvokationFailure: Failed to build apk. See the Console for details. : 네이버 블로그

유니티 commandinvokationfailure failed to build apk

Today I went through the same problems. I am using Unity version 2017. This might lead to incorrect line numbers in stacktraces andcompiler errors. Lots of professionals hang out there. Remember to check out for any 2D specific questions and conversation! Please release a support for unity 5. BuildPlayerWindow+BuildMethodException: Build failed with errors. Have a question about this project? Please include gradle 3 in your path, or install Android Studio.

Next

CommandInvokationFailure: Failed to align APK package.

유니티 commandinvokationfailure failed to build apk

Please make sure the android sdk path is correct. The solution of updating the Tools folder did not solve my problem ether. You can not withdraw support like that. Tried all above solutions with no success: Tried to reinstalling everything several times with several Unity Versions with no success. Any chance someone else is having this and knows of a viable solution? Seems that Unity has issues with the new Android 24 build tools. If you are a moderator, see our page.

Next

Unity Issue Tracker

유니티 commandinvokationfailure failed to build apk

I saw pages of this bug since July 12. Hello, I just updated to Unity 2017. Someone could help me with this problem? See the console for more details. Helpful Unity3D Links Related Subreddits New! I was getting the unable to find target platforms error. When debugging it shows some permission issues.

Next

CommandInvokationFailure: Failed to build apk. · Issue #956 · playgameservices/play

유니티 commandinvokationfailure failed to build apk

And when passing to Gradle, I have this instead :. Chat Rooms Use the chat room if you're new to Unity or have a quick question. But the problem here is that my password is correct, I am absolutly sure it's correct. BuildPlayerWindow + BuildMethodException: Yapı hatalarla başarısız oldu. CommandInvokationFailure: Unable to convert classes into dex format. Rules and Wiki Please refer to our Wiki before posting! I have tried the following: 1.

Next

유니티 Build Error

유니티 commandinvokationfailure failed to build apk

. Has anyone found any solution to this that doesn't require switching to the Gradle build system when using complex passwords? I've never had this problem before. This was not a problem in any Unity 4 or 5 versions, only in 2017! Solved by making sure the keystore is selected. For whatever reason when it's not selected but you forget to type in some password instead of saying that it's not selected it just says that the password is missing using logic it would seem safe to assume that such error message confirms that the keystore is actually selected but the password is simply missing. Videos are mostly self contained. Hello, We have a legacy project going on and its in 5.

Next

Unity打包Android问题记录 Gradle build

유니티 commandinvokationfailure failed to build apk

BuildPlayerWindow+BuildMethodException: 3 errors at UnityEditor. BuildPlayerWindow+BuildMethodException: Build failed with errors. What went wrong: A problem occurred configuring root project 'android'. I read that Android signing process was updated, and is there any thing new I need to do to make it build in Unity 2017? Here is a potential solution if you cannot get Unity to complete an Android build with no errors. Android build is not working on oreo 8 and a blank black screen shown at the launch. Failed to execute the build command. Build your project After that it didn't work for me yet, I had to 5.

Next